Reaction Details
TargetAldehyde oxidase 1
LigandBDBM175346
Substrate/Competitorn/a
Meas. Tech.AO Enzyme Assay
pH7±n/a
Ki 4.42e+5± 1.90e+4 nM
Commentsextracted
Citation Siah, MFarzaei, MHAshrafi-Kooshk, MRAdibi, HArab, SSRashidi, MRKhodarahmi, R Inhibition of guinea pig aldehyde oxidase activity by different flavonoid compounds: An in vitro study. Bioorg Chem64:74-84 (2016) 
 
Aldehyde oxidase 1
Name:Aldehyde oxidase 1
Type:Protein
Mol. Mass.:145280.02
Organism:Cavia porcellus (Guinea pig)
Description:H9TB17
Residue:1332
BDBM175346
NameBDBM175346
Synonyms:2'-Hydroxy Benzofuranone (2'-OH) | 6-Hydroxy-2-(2'-hydroxybenzylidene)benzofuran-3(2H)-one
TypeSmall organic molecule
Emp. Form.C8H6O3
Mol. Mass.150.1314
SMILESOC1Oc2ccccc2C1=O