Reaction Details
TargetPlasminogen activator inhibitor 1
LigandBDBM50058812
Substrate/Competitorn/a
Meas. Tech.Fluorometric Plate Assay
pH7.8±n/a
Temperature296.15±n/a K
IC50 269000±n/a nM
Commentsextracted
Citation Lawrence, DAEmal, CCale, JSu, EJWarnock, MLi, SCupp, JA Plasminogen activator inhibitor-1 inhibitors and methods of use thereof to modulate lipid metabolism US Patent US9120744 Publication Date 9/1/2015
 
Plasminogen activator inhibitor 1
Name:Plasminogen activator inhibitor 1
Type:Enzyme
Mol. Mass.:45064.00
Organism:Homo sapiens (Human)
Description:P05121
Residue:402
BDBM50058812
NameBDBM50058812
Synonyms:CHEMBL302625 US9120744, CDE-070
TypeSmall organic molecule
Emp. Form.C17H18N2O8
Mol. Mass.378.3334
SMILESOc1cc(cc(O)c1O)C(=O)NCCCNC(=O)c1cc(O)c(O)c(O)c1