Reaction Details
TargetPlasminogen activator inhibitor 1
LigandBDBM92487
Substrate/Competitorn/a
Meas. Tech.Surface Plasmon Resonance (SPR) Assay
pH5±n/a
Temperature296.15±n/a K
Kd 31±2 nM
Commentsextracted
Citation Lawrence, DAEmal, CCale, JSu, EJWarnock, MLi, SCupp, JA Plasminogen activator inhibitor-1 inhibitors and methods of use thereof to modulate lipid metabolism US Patent US9120744 Publication Date 9/1/2015
 
Plasminogen activator inhibitor 1
Name:Plasminogen activator inhibitor 1
Type:Enzyme
Mol. Mass.:45064.00
Organism:Homo sapiens (Human)
Description:P05121
Residue:402
BDBM92487
NameBDBM92487
Synonyms:CDE-031 | US9120744, CDE-031
TypeSmall organic molecule
Emp. Form.C20H20O10
Mol. Mass.420.3668
SMILESOc1cc(cc(O)c1O)C(=O)O[C@@H]1CCCC[C@@H]1OC(=O)c1cc(O)c(O)c(O)c1