Reaction Details
TargetMaternal embryonic leucine zipper kinase
LigandBDBM176910
Substrate/Competitorn/a
Meas. Tech.Kinase Assay
pH7.4±n/a
Temperature298.15±n/a K
IC50 0.8±n/a nM
Commentsextracted
Citation Matsuo, YHisada, SNakamura, YAhmed, FHuntley, RWalker, JRDecornez, H Quinoline derivatives and MELK inhibitors containing the same US Patent US9120749 Publication Date 9/1/2015
 
Maternal embryonic leucine zipper kinase
Name:Maternal embryonic leucine zipper kinase
Type:Enzyme
Mol. Mass.:74665.45
Organism:Homo sapiens (Human)
Description:Q14680
Residue:651
BDBM176910
NameBDBM176910
Synonyms:US9120749, 276
TypeSmall organic molecule
Emp. Form.C28H32ClN3O3
Mol. Mass.494.025
SMILESCOc1cc(cc(Cl)c1O)-c1ccc2ncc(C(=O)C3CC3)c(N3CCC(CN(C)C)CC3)c2c1