Reaction Details
TargetMaternal embryonic leucine zipper kinase
LigandBDBM177143
Substrate/Competitorn/a
Meas. Tech.Kinase Assay
pH7.4±n/a
Temperature298.15±n/a K
IC50 1.3±n/a nM
Commentsextracted
Citation Matsuo, YHisada, SNakamura, YAhmed, FHuntley, RWalker, JRDecornez, H Quinoline derivatives and MELK inhibitors containing the same US Patent US9120749 Publication Date 9/1/2015
 
Maternal embryonic leucine zipper kinase
Name:Maternal embryonic leucine zipper kinase
Type:Enzyme
Mol. Mass.:74665.45
Organism:Homo sapiens (Human)
Description:Q14680
Residue:651
BDBM177143
NameBDBM177143
Synonyms:US9120749, 509
TypeSmall organic molecule
Emp. Form.C25H20N6O
Mol. Mass.420.4659
SMILESNCc1ccc(Nc2c(cnc3ccc(cc23)-c2cnc(nc2)C#N)C(=O)C2CC2)cc1