Reaction Details
TargetMaternal embryonic leucine zipper kinase
LigandBDBM177154
Substrate/Competitorn/a
Meas. Tech.Kinase Assay
pH7.4±n/a
Temperature298.15±n/a K
IC50 1.6±n/a nM
Commentsextracted
Citation Matsuo, YHisada, SNakamura, YAhmed, FHuntley, RWalker, JRDecornez, H Quinoline derivatives and MELK inhibitors containing the same US Patent US9120749 Publication Date 9/1/2015
 
Maternal embryonic leucine zipper kinase
Name:Maternal embryonic leucine zipper kinase
Type:Enzyme
Mol. Mass.:74665.45
Organism:Homo sapiens (Human)
Description:Q14680
Residue:651
BDBM177154
NameBDBM177154
Synonyms:US9120749, 520
TypeSmall organic molecule
Emp. Form.C27H25ClFN5O2
Mol. Mass.505.971
SMILESOc1c(F)cc(cc1Cl)-c1ccc2ncc(C(=O)C3CC3)c(Nc3cnn(c3)C3CCNCC3)c2c1