Reaction Details
TargetMaternal embryonic leucine zipper kinase
LigandBDBM177218
Substrate/Competitorn/a
Meas. Tech.Kinase Assay
pH7.4±n/a
Temperature298.15±n/a K
IC50 1.4±n/a nM
Commentsextracted
Citation Matsuo, YHisada, SNakamura, YAhmed, FHuntley, RWalker, JRDecornez, H Quinoline derivatives and MELK inhibitors containing the same US Patent US9120749 Publication Date 9/1/2015
 
Maternal embryonic leucine zipper kinase
Name:Maternal embryonic leucine zipper kinase
Type:Enzyme
Mol. Mass.:74665.45
Organism:Homo sapiens (Human)
Description:Q14680
Residue:651
BDBM177218
NameBDBM177218
Synonyms:US9120749, 584 | US9120749, 585
TypeSmall organic molecule
Emp. Form.C30H33Cl2N3O2
Mol. Mass.538.508
SMILESOc1c(Cl)cc(cc1Cl)-c1ccc2ncc(C(=O)C3CC3)c(N[C@H]3CC[C@H](CN4CCCC4)CC3)c2c1