Reaction Details
TargetMaternal embryonic leucine zipper kinase
LigandBDBM177334
Substrate/Competitorn/a
Meas. Tech.Kinase Assay
pH7.4±n/a
Temperature298.15±n/a K
IC50 1.5±n/a nM
Commentsextracted
Citation Matsuo, YHisada, SNakamura, YAhmed, FHuntley, RWalker, JRDecornez, H Quinoline derivatives and MELK inhibitors containing the same US Patent US9120749 Publication Date 9/1/2015
 
Maternal embryonic leucine zipper kinase
Name:Maternal embryonic leucine zipper kinase
Type:Enzyme
Mol. Mass.:74665.45
Organism:Homo sapiens (Human)
Description:Q14680
Residue:651
BDBM177334
NameBDBM177334
Synonyms:US9120749, 700
TypeSmall organic molecule
Emp. Form.C28H30Cl2FN3O2
Mol. Mass.530.461
SMILESOc1c(Cl)cc(cc1Cl)-c1ccc2ncc(C(=O)C3CC3)c(N[C@H]3CC[C@H](CNCCF)CC3)c2c1