Reaction Details
TargetMaternal embryonic leucine zipper kinase
LigandBDBM177337
Substrate/Competitorn/a
Meas. Tech.Kinase Assay
pH7.4±n/a
Temperature298.15±n/a K
IC50 1.3±n/a nM
Commentsextracted
Citation Matsuo, YHisada, SNakamura, YAhmed, FHuntley, RWalker, JRDecornez, H Quinoline derivatives and MELK inhibitors containing the same US Patent US9120749 Publication Date 9/1/2015
 
Maternal embryonic leucine zipper kinase
Name:Maternal embryonic leucine zipper kinase
Type:Enzyme
Mol. Mass.:74665.45
Organism:Homo sapiens (Human)
Description:Q14680
Residue:651
BDBM177337
NameBDBM177337
Synonyms:US9120749, 703
TypeSmall organic molecule
Emp. Form.C28H27Cl2N5O2
Mol. Mass.536.452
SMILESCN1CCCC(C1)n1cc(Nc2c(cnc3ccc(cc23)-c2cc(Cl)c(O)c(Cl)c2)C(=O)C2CC2)cn1