Reaction Details
TargetMaternal embryonic leucine zipper kinase
LigandBDBM177373
Substrate/Competitorn/a
Meas. Tech.Kinase Assay
pH7.4±n/a
Temperature298.15±n/a K
IC50 1.3±n/a nM
Commentsextracted
Citation Matsuo, YHisada, SNakamura, YAhmed, FHuntley, RWalker, JRDecornez, H Quinoline derivatives and MELK inhibitors containing the same US Patent US9120749 Publication Date 9/1/2015
 
Maternal embryonic leucine zipper kinase
Name:Maternal embryonic leucine zipper kinase
Type:Enzyme
Mol. Mass.:74665.45
Organism:Homo sapiens (Human)
Description:Q14680
Residue:651
BDBM177373
NameBDBM177373
Synonyms:US9120749, 739 | US9120749, 740
TypeSmall organic molecule
Emp. Form.C27H31Cl2N3O2
Mol. Mass.500.46
SMILESCN(C)CC[C@H]1CC[C@@H](CC1)Nc1c(cnc2ccc(cc12)-c1cc(Cl)c(O)c(Cl)c1)C(C)=O