Reaction Details
TargetMaternal embryonic leucine zipper kinase
LigandBDBM177386
Substrate/Competitorn/a
Meas. Tech.Kinase Assay
pH7.4±n/a
Temperature298.15±n/a K
IC50 1±n/a nM
Commentsextracted
Citation Matsuo, YHisada, SNakamura, YAhmed, FHuntley, RWalker, JRDecornez, H Quinoline derivatives and MELK inhibitors containing the same US Patent US9120749 Publication Date 9/1/2015
 
Maternal embryonic leucine zipper kinase
Name:Maternal embryonic leucine zipper kinase
Type:Enzyme
Mol. Mass.:74665.45
Organism:Homo sapiens (Human)
Description:Q14680
Residue:651
BDBM177386
NameBDBM177386
Synonyms:US9120749, 752
TypeSmall organic molecule
Emp. Form.C27H32ClN3O3
Mol. Mass.482.014
SMILESCOc1cc(cc(Cl)c1O)-c1ccc2ncc(C(C)=O)c(N[C@@H]3CCC[C@@H](CN(C)C)C3)c2c1