Reaction Details
TargetMaternal embryonic leucine zipper kinase
LigandBDBM177546
Substrate/Competitorn/a
Meas. Tech.Kinase Assay
pH7.4±n/a
Temperature298.15±n/a K
IC50 0.94±n/a nM
Commentsextracted
Citation Matsuo, YHisada, SNakamura, YAhmed, FHuntley, RWalker, JRDecornez, H Quinoline derivatives and MELK inhibitors containing the same US Patent US9120749 Publication Date 9/1/2015
 
Maternal embryonic leucine zipper kinase
Name:Maternal embryonic leucine zipper kinase
Type:Enzyme
Mol. Mass.:74665.45
Organism:Homo sapiens (Human)
Description:Q14680
Residue:651
BDBM177546
NameBDBM177546
Synonyms:US9120749, 913
TypeSmall organic molecule
Emp. Form.C26H25Cl2N5O3S
Mol. Mass.558.479
SMILESCS(=O)(=O)c1cnc2ccc(cc2c1Nc1ccc(nc1)N1CCCC(N)C1)-c1cc(Cl)c(O)c(Cl)c1