Reaction Details
TargetMaternal embryonic leucine zipper kinase
LigandBDBM177567
Substrate/Competitorn/a
Meas. Tech.Kinase Assay
pH7.4±n/a
Temperature298.15±n/a K
IC50 1.2±n/a nM
Commentsextracted
Citation Matsuo, YHisada, SNakamura, YAhmed, FHuntley, RWalker, JRDecornez, H Quinoline derivatives and MELK inhibitors containing the same US Patent US9120749 Publication Date 9/1/2015
 
Maternal embryonic leucine zipper kinase
Name:Maternal embryonic leucine zipper kinase
Type:Enzyme
Mol. Mass.:74665.45
Organism:Homo sapiens (Human)
Description:Q14680
Residue:651
BDBM177567
NameBDBM177567
Synonyms:US9120749, 934
TypeSmall organic molecule
Emp. Form.C28H27Cl2N5O2
Mol. Mass.536.452
SMILESCCC(=O)c1cnc2ccc(cc2c1Nc1ccc(nc1)N1CCC[C@H](N)C1)-c1cc(Cl)c(O)c(Cl)c1