Reaction Details
TargetApoptosis regulator Bcl-2
LigandBDBM60819
Substrate/Competitorn/a
Meas. Tech.Time Resolved-Fluorescence Resonance Energy Transfer (TR-FRET) Assay
Ki<0.010±n/a nM
Citation Bruncko, MDing, HDoherty, GAElmore, SWHasvold, LHexamer, LAKunzer, ARMantei, RAMcClellan, WJPark, CHPark, CPetros, AMSong, XSouers, AJSullivan, GMTao, ZWang, GTWang, LWang, XWendt, MD Bcl-2-selective apoptosis-inducing agents for the treatment of cancer and immune diseases US Patent US9125913 Publication Date 9/8/2015
 
Apoptosis regulator Bcl-2
Name:Apoptosis regulator Bcl-2
Type:Homodimer or heterodimer
Mol. Mass.:26269.11
Organism:Homo sapiens (Human)
Description:P10415
Residue:239
BDBM60819
NameBDBM60819
Synonyms:US9174982, 204
Typen/a
Emp. Form.C46H50ClN7O8S
Mol. Mass.896.449
SMILESCC1(C)CCC(CN2CCN(CC2)c2ccc(C(=O)NS(=O)(=O)c3ccc(NC4C[C@H]5C[C@@H]4[C@H](O)[C@H]5O)c(c3)[N+]([O-])=O)c(Oc3cnc4[nH]ccc4c3)c2)=C(C1)c1ccc(Cl)cc1