Reaction Details
TargetApoptosis regulator Bcl-2
LigandBDBM178574
Substrate/Competitorn/a
Meas. Tech.Time Resolved-Fluorescence Resonance Energy Transfer (TR-FRET) Assay
Ki 0.009±n/a nM
Citation Bruncko, MDing, HDoherty, GAElmore, SWHasvold, LHexamer, LAKunzer, ARMantei, RAMcClellan, WJPark, CHPark, CPetros, AMSong, XSouers, AJSullivan, GMTao, ZWang, GTWang, LWang, XWendt, MD Bcl-2-selective apoptosis-inducing agents for the treatment of cancer and immune diseases US Patent US9125913 Publication Date 9/8/2015
 
Apoptosis regulator Bcl-2
Name:Apoptosis regulator Bcl-2
Type:Protein
Mol. Mass.:26409.44
Organism:Mus musculus (Mouse)
Description:P10417
Residue:236
BDBM178574
NameBDBM178574
Synonyms:US9125913, 133
TypeSmall organic molecule
Emp. Form.C46H52ClN7O7S
Mol. Mass.882.466
SMILESCN(C)CCOc1ccc(c(CN2CCN(CC2)c2ccc(C(=O)NS(=O)(=O)c3ccc(NC4CCN(C)CC4)c(c3)[N+]([O-])=O)c(Oc3ccccc3)c2)c1)-c1ccc(Cl)cc1