Reaction Details
TargetApoptosis regulator Bcl-2
LigandBDBM178837
Substrate/Competitorn/a
Meas. Tech.Time Resolved-Fluorescence Resonance Energy Transfer (TR-FRET) Assay
Ki<0.010±n/a nM
Citation Bruncko, MDing, HDoherty, GAElmore, SWHasvold, LHexamer, LAKunzer, ARMantei, RAMcClellan, WJPark, CHPark, CPetros, AMSong, XSouers, AJSullivan, GMTao, ZWang, GTWang, LWang, XWendt, MD Bcl-2-selective apoptosis-inducing agents for the treatment of cancer and immune diseases US Patent US9125913 Publication Date 9/8/2015
 
Apoptosis regulator Bcl-2
Name:Apoptosis regulator Bcl-2
Type:Protein
Mol. Mass.:26409.44
Organism:Mus musculus (Mouse)
Description:P10417
Residue:236
BDBM178837
NameBDBM178837
Synonyms:US9125913, 409
TypeSmall organic molecule
Emp. Form.C45H49ClFN7O7S
Mol. Mass.886.43
SMILESCC1(C)CCC(CN2CCN(CC2)c2ccc(C(=O)NS(=O)(=O)c3ccc(NCC4(F)CCOCC4)c(c3)[N+]([O-])=O)c(Oc3cccc4[nH]ncc34)c2)=C(C1)c1ccc(Cl)cc1