Reaction Details
TargetApoptosis regulator Bcl-2
LigandBDBM178854
Substrate/Competitorn/a
Meas. Tech.Time Resolved-Fluorescence Resonance Energy Transfer (TR-FRET) Assay
Ki 0.007±n/a nM
Citation Bruncko, MDing, HDoherty, GAElmore, SWHasvold, LHexamer, LAKunzer, ARMantei, RAMcClellan, WJPark, CHPark, CPetros, AMSong, XSouers, AJSullivan, GMTao, ZWang, GTWang, LWang, XWendt, MD Bcl-2-selective apoptosis-inducing agents for the treatment of cancer and immune diseases US Patent US9125913 Publication Date 9/8/2015
 
Apoptosis regulator Bcl-2
Name:Apoptosis regulator Bcl-2
Type:Protein
Mol. Mass.:26409.44
Organism:Mus musculus (Mouse)
Description:P10417
Residue:236
BDBM178854
NameBDBM178854
Synonyms:US9125913, 426
TypeSmall organic molecule
Emp. Form.C47H54Cl2N8O7S
Mol. Mass.945.952
SMILESCN(C)CC(=O)N1CCO[C@@H](COc2ncc(cc2Cl)S(=O)(=O)NC(=O)c2ccc(cc2Oc2cccc3[nH]ncc23)N2CCN(CC3=C(CC(C)(C)CC3)c3ccc(Cl)cc3)CC2)C1