Reaction Details
TargetBcl-2-like protein 1
LigandBDBM178880
Substrate/Competitorn/a
Meas. Tech.Time Resolved-Fluorescence Resonance Energy Transfer (TR-FRET) Assay
Ki 6.004±n/a nM
Citation Bruncko, MDing, HDoherty, GAElmore, SWHasvold, LHexamer, LAKunzer, ARMantei, RAMcClellan, WJPark, CHPark, CPetros, AMSong, XSouers, AJSullivan, GMTao, ZWang, GTWang, LWang, XWendt, MD Bcl-2-selective apoptosis-inducing agents for the treatment of cancer and immune diseases US Patent US9125913 Publication Date 9/8/2015
 
Bcl-2-like protein 1
Name:Bcl-2-like protein 1
Type:Protein
Mol. Mass.:26122.63
Organism:Mus musculus (Mouse)
Description:Q64373
Residue:233
BDBM178880
NameBDBM178880
Synonyms:US9125913, 452
TypeSmall organic molecule
Emp. Form.C49H57ClN8O7S
Mol. Mass.937.544
SMILESCC1(C)CCC(CN2CCN(CC2)c2ccc(C(=O)NS(=O)(=O)c3ccc(NC4CCC(CC4)N4CCOCC4)c(c3)[N+]([O-])=O)c(Oc3cccc4[nH]cnc34)c2)=C(C1)c1ccc(Cl)cc1