Reaction Details
TargetBromodomain-containing protein 4/Histone H4
LigandBDBM179282
Substrate/Competitorn/a
Meas. Tech.Time Resolved Fluorescence Resonance Energy Transfer (TR-FRET) Assay
Temperature298.15±n/a K
IC50 54.2±n/a nM
Commentsextracted
Citation Miyoshi, SOoike, SIwata, KHikawa, HSugahara, K Antitumor agent US Patent US9125915 Publication Date 9/8/2015
 
Bromodomain-containing protein 4/Histone H4
Name:Bromodomain-containing protein 4/Histone H4
Synonyms:H4-BRD4
Type:Protein
Mol. Mass.:n/a
Description:n/a
Components:This complex has 2 components.
Component 1
Name:Histone H4
Type:Protein
Mol. Mass.:11386.36
Organism:Homo sapiens (Human)
Description:P62805
Residue:103
Component 2
Name:Bromodomain-containing protein 4
Synonyms:BRD4 Bromodomain-containing protein 4 (BRD4) Protein HUNK1
Type:Protein
Mol. Mass.:152264.84
Organism:Homo sapiens (Human)
Description:O60885
Residue:1362
BDBM179282
NameBDBM179282
Synonyms:US9125915, compound 5
TypeSmall organic molecule
Emp. Form.C19H16Cl2N4O2S
Mol. Mass.435.327
SMILESCOC(=O)C[C@@H]1N=C(c2c(C)c(Cl)sc2-n2c(C)nnc12)c1ccc(Cl)cc1