Reaction Details
TargetPotassium channel subfamily K member 3
LigandBDBM179625
Substrate/Competitorn/a
Meas. Tech.Biological Assay
Temperature298.15±n/a K
IC50 215±n/a nM
Commentsextracted
Citation Bialy, LLorenz, KWirth, KSteinmeyer, KHessler, GPernerstorfer, JBrendel, J Substituted 4,5,6,7-tetrahydro-1H-pyrazolo[4,3-c]pyridines, their use as medicament, and pharmaceutical preparations comprising them US Patent US9127001 Publication Date 9/8/2015
 
Potassium channel subfamily K member 3
Name:Potassium channel subfamily K member 3
Type:Protein
Mol. Mass.:43534.71
Organism:Homo sapiens (Human)
Description:O14649
Residue:394
BDBM179625
NameBDBM179625
Synonyms:US9127001, 6c | US9598410, Compound 6c
TypeSmall organic molecule
Emp. Form.C21H18ClF3N4O
Mol. Mass.434.842
SMILESCC(=O)N1CCc2c(C1)c(nn2Cc1cnccc1Cl)-c1cccc(c1)C(F)(F)F