Reaction Details
TargetPotassium channel subfamily K member 3
LigandBDBM179635
Substrate/Competitorn/a
Meas. Tech.Biological Assay
Temperature298.15±n/a K
IC50 91±n/a nM
Commentsextracted
Citation Bialy, LLorenz, KWirth, KSteinmeyer, KHessler, GPernerstorfer, JBrendel, J Substituted 4,5,6,7-tetrahydro-1H-pyrazolo[4,3-c]pyridines, their use as medicament, and pharmaceutical preparations comprising them US Patent US9127001 Publication Date 9/8/2015
 
Potassium channel subfamily K member 3
Name:Potassium channel subfamily K member 3
Type:Protein
Mol. Mass.:43534.71
Organism:Homo sapiens (Human)
Description:O14649
Residue:394
BDBM179635
NameBDBM179635
Synonyms:US9127001, 6n | US9598410, Compound 6n
TypeSmall organic molecule
Emp. Form.C24H20F2N4O
Mol. Mass.418.4386
SMILESCC(=O)N1C2CCC1c1c(C2)n(Cc2ccc(F)cc2F)nc1-c1cccc(c1)C#N