Reaction Details
TargetPotassium channel subfamily K member 3
LigandBDBM179694
Substrate/Competitorn/a
Meas. Tech.Biological Assay
Temperature298.15±n/a K
IC50 47±n/a nM
Commentsextracted
Citation Bialy, LLorenz, KWirth, KSteinmeyer, KHessler, GPernerstorfer, JBrendel, J Substituted 4,5,6,7-tetrahydro-1H-pyrazolo[4,3-c]pyridines, their use as medicament, and pharmaceutical preparations comprising them US Patent US9127001 Publication Date 9/8/2015
 
Potassium channel subfamily K member 3
Name:Potassium channel subfamily K member 3
Type:Protein
Mol. Mass.:43534.71
Organism:Homo sapiens (Human)
Description:O14649
Residue:394
BDBM179694
NameBDBM179694
Synonyms:US9127001, 8c | US9598410, Compound 8c
TypeSmall organic molecule
Emp. Form.C24H20F2N4O
Mol. Mass.418.4386
SMILESFc1ccc(Cn2nc(c3CN(CCc23)C(=O)C2CC2)-c2cccc(c2)C#N)c(F)c1