Reaction Details
TargetOligo-1,6-glucosidase IMA1
LigandBDBM179766
Substrate/Competitorn/a
Meas. Tech.Assay for α-Glucosidase Inhibitory Activity
IC50 4.462e+4± 4.2e+2 nM
Citation Taha, MIsmail, NHImran, SMohamad, MHWadood, ARahim, FSaad, SMRehman, AUKhan, KM Synthesis, a-glucosidase inhibitory, cytotoxicity and docking studies of 2-aryl-7-methylbenzimidazoles. Bioorg Chem65:100-9 (2016) 
 
Oligo-1,6-glucosidase IMA1
Name:Oligo-1,6-glucosidase IMA1
Type:Protein
Mol. Mass.:68577.59
Organism:Saccharomyces cerevisiae S288c (Baker's yeast)
Description:n/a
Residue:589
BDBM179766
NameBDBM179766
Synonyms:2-(2'-Nitrophenyl)-7-methyl-1H-benzo[d]imidazole (7)
TypeSmall organic molecule
Emp. Form.C14H11N3O2
Mol. Mass.253.256
SMILESCc1cccc2nc([nH]c12)-c1ccccc1[N+]([O-])=O