Reaction Details
TargetOligo-1,6-glucosidase IMA1
LigandBDBM179767
Substrate/Competitorn/a
Meas. Tech.Assay for α-Glucosidase Inhibitory Activity
IC50 3.442e+4± 3.5e+2 nM
Citation Taha, MIsmail, NHImran, SMohamad, MHWadood, ARahim, FSaad, SMRehman, AUKhan, KM Synthesis, a-glucosidase inhibitory, cytotoxicity and docking studies of 2-aryl-7-methylbenzimidazoles. Bioorg Chem65:100-9 (2016) 
 
Oligo-1,6-glucosidase IMA1
Name:Oligo-1,6-glucosidase IMA1
Type:Protein
Mol. Mass.:68577.59
Organism:Saccharomyces cerevisiae S288c (Baker's yeast)
Description:n/a
Residue:589
BDBM179767
NameBDBM179767
Synonyms:2-(2'-Fluorophenyl)-7-methyl-1H-benzo[d]imidazole (8)
TypeSmall organic molecule
Emp. Form.C14H11FN2
Mol. Mass.226.2489
SMILESCc1cccc2nc([nH]c12)-c1ccccc1F