Reaction Details
TargetOligo-1,6-glucosidase IMA1
LigandBDBM179770
Substrate/Competitorn/a
Meas. Tech.Assay for α-Glucosidase Inhibitory Activity
IC50 2.205e+4± 2.18e+3 nM
Citation Taha, MIsmail, NHImran, SMohamad, MHWadood, ARahim, FSaad, SMRehman, AUKhan, KM Synthesis, a-glucosidase inhibitory, cytotoxicity and docking studies of 2-aryl-7-methylbenzimidazoles. Bioorg Chem65:100-9 (2016) 
 
Oligo-1,6-glucosidase IMA1
Name:Oligo-1,6-glucosidase IMA1
Type:Protein
Mol. Mass.:68577.59
Organism:Saccharomyces cerevisiae S288c (Baker's yeast)
Description:n/a
Residue:589
BDBM179770
NameBDBM179770
Synonyms:7-Methyl-2-(thiophen-2'-yl)-1H-benzo[d]imidazole (11)
TypeSmall organic molecule
Emp. Form.C12H10N2S
Mol. Mass.214.286
SMILESCc1cccc2nc([nH]c12)-c1cccs1