Reaction Details
TargetOligo-1,6-glucosidase IMA1
LigandBDBM179772
Substrate/Competitorn/a
Meas. Tech.Assay for α-Glucosidase Inhibitory Activity
IC50 4.520e+4± 3.9e+2 nM
Citation Taha, MIsmail, NHImran, SMohamad, MHWadood, ARahim, FSaad, SMRehman, AUKhan, KM Synthesis, a-glucosidase inhibitory, cytotoxicity and docking studies of 2-aryl-7-methylbenzimidazoles. Bioorg Chem65:100-9 (2016) 
 
Oligo-1,6-glucosidase IMA1
Name:Oligo-1,6-glucosidase IMA1
Type:Protein
Mol. Mass.:68577.59
Organism:Saccharomyces cerevisiae S288c (Baker's yeast)
Description:n/a
Residue:589
BDBM179772
NameBDBM179772
Synonyms:2-(2'-Hydroxy-5'-methoxyphenyl)-7-methyl-1H-benzo[d]imidazole (14)
TypeSmall organic molecule
Emp. Form.C15H14N2O2
Mol. Mass.254.2839
SMILESCOc1ccc(O)c(c1)-c1nc2cccc(C)c2[nH]1