Reaction Details
TargetOligo-1,6-glucosidase IMA1
LigandBDBM179773
Substrate/Competitorn/a
Meas. Tech.Assay for α-Glucosidase Inhibitory Activity
IC50 8.560e+4± 7.5e+2 nM
Citation Taha, MIsmail, NHImran, SMohamad, MHWadood, ARahim, FSaad, SMRehman, AUKhan, KM Synthesis, a-glucosidase inhibitory, cytotoxicity and docking studies of 2-aryl-7-methylbenzimidazoles. Bioorg Chem65:100-9 (2016) 
 
Oligo-1,6-glucosidase IMA1
Name:Oligo-1,6-glucosidase IMA1
Type:Protein
Mol. Mass.:68577.59
Organism:Saccharomyces cerevisiae S288c (Baker's yeast)
Description:n/a
Residue:589
BDBM179773
NameBDBM179773
Synonyms:2-(2',3'-Dihydroxyphenyl)-7-methyl-1H-benzo[d]imidazole (15)
TypeSmall organic molecule
Emp. Form.C14H12N2O2
Mol. Mass.240.2573
SMILESCc1cccc2nc([nH]c12)-c1cccc(O)c1O