Reaction Details
TargetOligo-1,6-glucosidase IMA1
LigandBDBM179778
Substrate/Competitorn/a
Meas. Tech.Assay for α-Glucosidase Inhibitory Activity
IC50 2.975e+4± 1.9e+2 nM
Citation Taha, MIsmail, NHImran, SMohamad, MHWadood, ARahim, FSaad, SMRehman, AUKhan, KM Synthesis, a-glucosidase inhibitory, cytotoxicity and docking studies of 2-aryl-7-methylbenzimidazoles. Bioorg Chem65:100-9 (2016) 
 
Oligo-1,6-glucosidase IMA1
Name:Oligo-1,6-glucosidase IMA1
Type:Protein
Mol. Mass.:68577.59
Organism:Saccharomyces cerevisiae S288c (Baker's yeast)
Description:n/a
Residue:589
BDBM179778
NameBDBM179778
Synonyms:2-(2'-Hydroxy-4'-methoxyphenyl)-7-methyl-1H-benzo[d]imidazole (20)
TypeSmall organic molecule
Emp. Form.C15H14N2O2
Mol. Mass.254.2839
SMILESCOc1ccc(-c2nc3cccc(C)c3[nH]2)c(O)c1