Reaction Details
TargetOligo-1,6-glucosidase IMA1
LigandBDBM179780
Substrate/Competitorn/a
Meas. Tech.Assay for α-Glucosidase Inhibitory Activity
IC50 7.2550e+5± 3.78e+3 nM
Citation Taha, MIsmail, NHImran, SMohamad, MHWadood, ARahim, FSaad, SMRehman, AUKhan, KM Synthesis, a-glucosidase inhibitory, cytotoxicity and docking studies of 2-aryl-7-methylbenzimidazoles. Bioorg Chem65:100-9 (2016) 
 
Oligo-1,6-glucosidase IMA1
Name:Oligo-1,6-glucosidase IMA1
Type:Protein
Mol. Mass.:68577.59
Organism:Saccharomyces cerevisiae S288c (Baker's yeast)
Description:n/a
Residue:589
BDBM179780
NameBDBM179780
Synonyms:7-Methyl-2-(pyridin-4'-yl)-1H-benzo[d]imidazole (24)
TypeSmall organic molecule
Emp. Form.C13H11N3
Mol. Mass.209.2465
SMILESCc1cccc2nc([nH]c12)-c1ccncc1