Reaction Details
TargetOligo-1,6-glucosidase IMA1
LigandBDBM179782
Substrate/Competitorn/a
Meas. Tech.Assay for α-Glucosidase Inhibitory Activity
IC50 3.2505e+5± 2.86e+3 nM
Citation Taha, MIsmail, NHImran, SMohamad, MHWadood, ARahim, FSaad, SMRehman, AUKhan, KM Synthesis, a-glucosidase inhibitory, cytotoxicity and docking studies of 2-aryl-7-methylbenzimidazoles. Bioorg Chem65:100-9 (2016) 
 
Oligo-1,6-glucosidase IMA1
Name:Oligo-1,6-glucosidase IMA1
Type:Protein
Mol. Mass.:68577.59
Organism:Saccharomyces cerevisiae S288c (Baker's yeast)
Description:n/a
Residue:589
BDBM179782
NameBDBM179782
Synonyms:2-(3'-Chlorophenyl)-7-methyl-1H-benzo[d]imidazole (26)
TypeSmall organic molecule
Emp. Form.C14H11ClN2
Mol. Mass.242.704
SMILESCc1cccc2nc([nH]c12)-c1cccc(Cl)c1