Reaction Details
TargetMitogen-activated protein kinase 1
LigandBDBM180936
Substrate/Competitorn/a
Meas. Tech.Enzymatic Assay
pH7.3±n/a
IC50 1.1±n/a nM
Commentsextracted
Citation Blake, JFChen, HChicarelli, MJDemeese, JGarrey, RGaudino, JJKaus, RJKolakowski, GRMarlow, ALMohr, PJRen, LSchwarz, JSiedem, CSThomas, AAWallace, EWenglowsky, SMBoyd, S Serine/threonine kinase inhibitors US Patent US9133187 Publication Date 9/15/2015
 
Mitogen-activated protein kinase 1
Name:Mitogen-activated protein kinase 1
Type:Ser/Thr Protein Kinase
Mol. Mass.:41392.76
Organism:Homo sapiens (Human)
Description:P28482
Residue:360
BDBM180936
NameBDBM180936
Synonyms:US9133187, I-16
TypeSmall organic molecule
Emp. Form.C19H23Cl2N5O2
Mol. Mass.424.324
SMILESCC(C)Nc1ncc2CCN(Cc2n1)C(=O)N[C@H](CO)c1ccc(Cl)c(Cl)c1