Reaction Details
TargetMitogen-activated protein kinase 1
LigandBDBM180945
Substrate/Competitorn/a
Meas. Tech.Enzymatic Assay
pH7.3±n/a
IC50 1.6±n/a nM
Commentsextracted
Citation Blake, JFChen, HChicarelli, MJDemeese, JGarrey, RGaudino, JJKaus, RJKolakowski, GRMarlow, ALMohr, PJRen, LSchwarz, JSiedem, CSThomas, AAWallace, EWenglowsky, SMBoyd, S Serine/threonine kinase inhibitors US Patent US9133187 Publication Date 9/15/2015
 
Mitogen-activated protein kinase 1
Name:Mitogen-activated protein kinase 1
Type:Ser/Thr Protein Kinase
Mol. Mass.:41392.76
Organism:Homo sapiens (Human)
Description:P28482
Residue:360
BDBM180945
NameBDBM180945
Synonyms:US9133187, I-50
TypeSmall organic molecule
Emp. Form.C21H23Cl2F2N5O2
Mol. Mass.486.342
SMILESC[C@@H](NC(=O)N1Cc2nc(NC3CCOCC3)ncc2C(F)(F)C1)c1ccc(Cl)c(Cl)c1