Reaction Details
TargetMitogen-activated protein kinase 1
LigandBDBM180948
Substrate/Competitorn/a
Meas. Tech.Enzymatic Assay
pH7.3±n/a
IC50 0.6±n/a nM
Commentsextracted
Citation Blake, JFChen, HChicarelli, MJDemeese, JGarrey, RGaudino, JJKaus, RJKolakowski, GRMarlow, ALMohr, PJRen, LSchwarz, JSiedem, CSThomas, AAWallace, EWenglowsky, SMBoyd, S Serine/threonine kinase inhibitors US Patent US9133187 Publication Date 9/15/2015
 
Mitogen-activated protein kinase 1
Name:Mitogen-activated protein kinase 1
Type:Ser/Thr Protein Kinase
Mol. Mass.:41392.76
Organism:Homo sapiens (Human)
Description:P28482
Residue:360
BDBM180948
NameBDBM180948
Synonyms:US9133187, I-59
TypeSmall organic molecule
Emp. Form.C22H24ClFN6O2
Mol. Mass.458.916
SMILESFc1ccc(cc1Cl)[C@@H](CC#N)NC(=O)N1CCc2cnc(NC3CCOCC3)nc2C1