Reaction Details
TargetCytochrome P450 3A4
LigandBDBM50176808
Substrate/Competitorn/a
Meas. Tech.n/a
IC50<100±n/a nM
Citation Bareja, SPJones, SDOblong, JEMills, KJBierman, JC Cosmetic compositions containing substituted azole and methods for improving the appearance of aging skin US Patent US9138393 Publication Date 9/22/2015
 
Cytochrome P450 3A4
Name:Cytochrome P450 3A4
Type:Enzyme
Mol. Mass.:57349.57
Organism:Homo sapiens (Human)
Description:n/a
Residue:503
BDBM50176808
NameBDBM50176808
Synonyms:5-[(3-Chloro-phenyl)-imidazol-1-yl-methyl]-1H-benzoimidazole CHEMBL389433 US9144538, Liarizole hydrochloride | liarozole
TypeSmall organic molecule
Emp. Form.C17H13ClN4
Mol. Mass.308.765
SMILESClc1cccc(c1)C(c1ccc2nc[nH]c2c1)n1ccnc1