Reaction Details
TargetCytochrome P450 3A4
LigandBDBM181118
Substrate/Competitorn/a
Meas. Tech.In vitro CYP3A4 Inhibition Assay
IC50>10000±n/a nM
Citation Bareja, SPJones, SDOblong, JEMills, KJBierman, JC Cosmetic compositions containing substituted azole and methods for alleviating the signs of photoaged skin US Patent US9144538 Publication Date 9/29/2015
 
Cytochrome P450 3A4
Name:Cytochrome P450 3A4
Type:Enzyme
Mol. Mass.:57349.57
Organism:Homo sapiens (Human)
Description:n/a
Residue:503
BDBM181118
NameBDBM181118
Synonyms:US9138393, Histidine | US9144538, Histidine
TypeSmall organic molecule
Emp. Form.C6H9N3O2
Mol. Mass.155.1546
SMILESN[C@@H](Cc1c[nH]cn1)C(O)=O