Reaction Details
TargetLeucine-rich repeat serine/threonine-protein kinase 2
LigandBDBM182707
Substrate/Competitorn/a
Meas. Tech.In vitro LRRK2 Lanthascreen Binding Assay
Ki 12±n/a nM
Citation Baker-Glenn, CChambers, MChan, BKEstrada, AShore, DSweeney, ZKChen, H Aminopyrimidine derivatives as LRRK2 modulators US Patent US9145402 Publication Date 9/29/2015
 
Leucine-rich repeat serine/threonine-protein kinase 2
Name:Leucine-rich repeat serine/threonine-protein kinase 2
Type:Protein
Mol. Mass.:286113.20
Organism:Homo sapiens (Human)
Description:Q5S007
Residue:2527
BDBM182707
NameBDBM182707
Synonyms:US9145402, 13
TypeSmall organic molecule
Emp. Form.C15H14F3N5O
Mol. Mass.337.2998
SMILESCNc1nc(Nc2cc(C)c(cc2OC)C#N)ncc1C(F)(F)F