Reaction Details
TargetLeucine-rich repeat serine/threonine-protein kinase 2
LigandBDBM182726
Substrate/Competitorn/a
Meas. Tech.In vitro LRRK2 Lanthascreen Binding Assay
Ki 3±n/a nM
Citation Baker-Glenn, CChambers, MChan, BKEstrada, AShore, DSweeney, ZKChen, H Aminopyrimidine derivatives as LRRK2 modulators US Patent US9145402 Publication Date 9/29/2015
 
Leucine-rich repeat serine/threonine-protein kinase 2
Name:Leucine-rich repeat serine/threonine-protein kinase 2
Type:Protein
Mol. Mass.:286113.20
Organism:Homo sapiens (Human)
Description:Q5S007
Residue:2527
BDBM182726
NameBDBM182726
Synonyms:US9145402, 33
TypeSmall organic molecule
Emp. Form.C16H16F4N4O2
Mol. Mass.372.3175
SMILESCNc1nc(Nc2cc(F)c(cc2OC)C2COC2)ncc1C(F)(F)F