Reaction Details
TargetLeucine-rich repeat serine/threonine-protein kinase 2
LigandBDBM182730
Substrate/Competitorn/a
Meas. Tech.In vitro LRRK2 Lanthascreen Binding Assay
Ki 56±n/a nM
Citation Baker-Glenn, CChambers, MChan, BKEstrada, AShore, DSweeney, ZKChen, H Aminopyrimidine derivatives as LRRK2 modulators US Patent US9145402 Publication Date 9/29/2015
 
Leucine-rich repeat serine/threonine-protein kinase 2
Name:Leucine-rich repeat serine/threonine-protein kinase 2
Type:Protein
Mol. Mass.:286113.20
Organism:Homo sapiens (Human)
Description:Q5S007
Residue:2527
BDBM182730
NameBDBM182730
Synonyms:US9145402, 37
TypeSmall organic molecule
Emp. Form.C18H21F4N5O2
Mol. Mass.415.3853
SMILESCNc1nc(Nc2cc(F)c(CN3CCOCC3)cc2OC)ncc1C(F)(F)F