Reaction Details
TargetSterol O-acyltransferase 1
LigandBDBM182855
Substrate/Competitorn/a
Meas. Tech.Inhibition Assay
IC50 39000±n/a nM
Citation Chang, TChang, CCShibuya, YBryleva, EMurphy, SRogers, MA Method for selectively inhibiting ACAT1 in the treatment of alzheimer's disease US Patent US9149492 Publication Date 10/6/2015
 
Sterol O-acyltransferase 1
Name:Sterol O-acyltransferase 1
Type:Multi-pass membrane protein may form homo- or heterodimers.
Mol. Mass.:64751.94
Organism:Homo sapiens (Human)
Description:P35610
Residue:550
BDBM182855
NameBDBM182855
Synonyms:US9149492, 16
TypeSmall organic molecule
Emp. Form.C25H33N3
Mol. Mass.375.5496
SMILESCCCCCCCCCCNc1cc(nn1-c1ccccc1)-c1ccccc1