Reaction Details
TargetSterol O-acyltransferase 2
LigandBDBM50371698
Substrate/Competitorn/a
Meas. Tech.Inhibition Assay
IC50 230000±n/a nM
Citation Chang, TChang, CCShibuya, YBryleva, EMurphy, SRogers, MA Method for selectively inhibiting ACAT1 in the treatment of alzheimer's disease US Patent US9149492 Publication Date 10/6/2015
 
Sterol O-acyltransferase 2
Name:Sterol O-acyltransferase 2
Type:Enzyme
Mol. Mass.:59912.75
Organism:Homo sapiens (Human)
Description:O75908
Residue:522
BDBM50371698
NameBDBM50371698
Synonyms:CHEMBL408322 | US9149492, 1
TypeSmall organic molecule
Emp. Form.C20H25NO
Mol. Mass.295.4186
SMILESCCCCCCCC(=O)Nc1ccccc1-c1ccccc1