Reaction Details
TargetSterol O-acyltransferase 2
LigandBDBM182855
Substrate/Competitorn/a
Meas. Tech.Inhibition Assay
IC50 97000±n/a nM
Citation Chang, TChang, CCShibuya, YBryleva, EMurphy, SRogers, MA Method for selectively inhibiting ACAT1 in the treatment of alzheimer's disease US Patent US9149492 Publication Date 10/6/2015
 
Sterol O-acyltransferase 2
Name:Sterol O-acyltransferase 2
Type:Enzyme
Mol. Mass.:59912.75
Organism:Homo sapiens (Human)
Description:O75908
Residue:522
BDBM182855
NameBDBM182855
Synonyms:US9149492, 16
TypeSmall organic molecule
Emp. Form.C25H33N3
Mol. Mass.375.5496
SMILESCCCCCCCCCCNc1cc(nn1-c1ccccc1)-c1ccccc1