Reaction Details
TargetLysosomal protective protein [29-480]
LigandBDBM183801
Substrate/Competitorn/a
Meas. Tech.Inhibition Assay
pH6±n/a
Temperature310.15±n/a K
IC50 11±n/a nM
Commentsextracted
Citation Ruf, SSadowski, TWirth, KSchreuder, HBuning, CKallus, CStrobel, HWehlan, H Biaryl-propionic acid derivatives and their use as pharmaceuticals US Patent US9150526 Publication Date 10/6/2015
 
Lysosomal protective protein [29-480]
Name:Lysosomal protective protein [29-480]
Type:n/a
Mol. Mass.:51408.15
Organism:Homo sapiens (Human)
Description:P10619[29-480]
Residue:452
BDBM183801
NameBDBM183801
Synonyms:US9150526, 51
TypeSmall organic molecule
Emp. Form.C21H21NO4S
Mol. Mass.383.461
SMILESCOc1cccc(OC)c1-c1cccc(c1)C(CC(O)=O)c1ncc(C)s1