Reaction Details
TargetLysosomal protective protein [29-480]
LigandBDBM183927
Substrate/Competitorn/a
Meas. Tech.Inhibition Assay
pH6±n/a
Temperature310.15±n/a K
IC50 27±n/a nM
Commentsextracted
Citation Ruf, SSadowski, TWirth, KSchreuder, HBuning, CKallus, CStrobel, HWehlan, H Biaryl-propionic acid derivatives and their use as pharmaceuticals US Patent US9150526 Publication Date 10/6/2015
 
Lysosomal protective protein [29-480]
Name:Lysosomal protective protein [29-480]
Type:n/a
Mol. Mass.:51408.15
Organism:Homo sapiens (Human)
Description:P10619[29-480]
Residue:452
BDBM183927
NameBDBM183927
Synonyms:US9150526, 185
TypeSmall organic molecule
Emp. Form.C22H24N2O4
Mol. Mass.380.437
SMILESCOc1ccc(cc1-c1cccc(c1)[C@@H](CC(O)=O)c1nnc(C)o1)C(C)C