Reaction Details
TargetLysosomal protective protein [29-480]
LigandBDBM183938
Substrate/Competitorn/a
Meas. Tech.Inhibition Assay
pH6±n/a
Temperature310.15±n/a K
IC50 14±n/a nM
Commentsextracted
Citation Ruf, SSadowski, TWirth, KSchreuder, HBuning, CKallus, CStrobel, HWehlan, H Biaryl-propionic acid derivatives and their use as pharmaceuticals US Patent US9150526 Publication Date 10/6/2015
 
Lysosomal protective protein [29-480]
Name:Lysosomal protective protein [29-480]
Type:n/a
Mol. Mass.:51408.15
Organism:Homo sapiens (Human)
Description:P10619[29-480]
Residue:452
BDBM183938
NameBDBM183938
Synonyms:US9150526, 201
TypeSmall organic molecule
Emp. Form.C21H19F3N2O5
Mol. Mass.436.3812
SMILESCOc1ccc(OC)c(c1)-c1cc(cc(c1)C(F)(F)F)C(CC(O)=O)c1nnc(C)o1