Reaction Details
TargetLysosomal protective protein [29-480]
LigandBDBM183943
Substrate/Competitorn/a
Meas. Tech.Inhibition Assay
pH6±n/a
Temperature310.15±n/a K
IC50 6±n/a nM
Commentsextracted
Citation Ruf, SSadowski, TWirth, KSchreuder, HBuning, CKallus, CStrobel, HWehlan, H Biaryl-propionic acid derivatives and their use as pharmaceuticals US Patent US9150526 Publication Date 10/6/2015
 
Lysosomal protective protein [29-480]
Name:Lysosomal protective protein [29-480]
Type:n/a
Mol. Mass.:51408.15
Organism:Homo sapiens (Human)
Description:P10619[29-480]
Residue:452
BDBM183943
NameBDBM183943
Synonyms:US9150526, 206
TypeSmall organic molecule
Emp. Form.C22H21F3N2O5
Mol. Mass.450.4077
SMILESCOc1cc(C)cc(OC)c1-c1cc(cc(c1)C(F)(F)F)C(CC(O)=O)c1nnc(C)o1