Reaction Details
TargetNeuronal acetylcholine receptor subunit alpha-7
LigandBDBM50395220
Substrate/Competitorn/a
Meas. Tech.Inhibition Assay
Ki>2000±n/a nM
Citation Carroll, FIOndachi, PWNavarro, HADamaj, MIWoods, JHJutkiewicz, EM Nicotinic receptor compounds US Patent US9150581 Publication Date 10/6/2015
 
Neuronal acetylcholine receptor subunit alpha-7
Name:Neuronal acetylcholine receptor subunit alpha-7
Type:Enzyme
Mol. Mass.:56502.44
Organism:Rattus norvegicus (Rat)
Description:Q05941
Residue:502
BDBM50395220
NameBDBM50395220
Synonyms:CHEMBL2164664 | US9150581, RTI-7527-(+/-)-154
TypeSmall organic molecule
Emp. Form.C18H19FN2O2S
Mol. Mass.346.419
SMILESCS(=O)(=O)c1ccc(cc1)-c1cc(cnc1F)C1CC2CCC1N2