Reaction Details
TargetLeucine-rich repeat serine/threonine-protein kinase 2 [G2019S]
LigandBDBM185485
Substrate/Competitorn/a
Meas. Tech.Lantha Screen Technology Assay
pH7.5±n/a
IC50 27±n/a nM
Commentsextracted
Citation Galatsis, PHayward, MMKormos, BLWager, TTZhang, LStepan, AFHenderson, JLKurumbail, RGVerhoest, PR 4-(substituted amino)-7H-pyrrolo[2,3-d] pyrimidines as LRRK2 inhibitors US Patent US9156845 Publication Date 10/13/2015
 
Leucine-rich repeat serine/threonine-protein kinase 2 [G2019S]
Name:Leucine-rich repeat serine/threonine-protein kinase 2 [G2019S]
Type:n/a
Mol. Mass.:286143.23
Organism:Homo sapiens (Human)
Description:Q5S007(G2019S)
Residue:2527
BDBM185485
NameBDBM185485
Synonyms:US9156845, 138
TypeSmall organic molecule
Emp. Form.C18H17N5O
Mol. Mass.319.3605
SMILESOC1CCCN(C1)c1ncnc2[nH]cc(-c3cccc(c3)C#N)c12