Reaction Details
TargetProto-oncogene tyrosine-protein kinase Src [251-533]
LigandBDBM185673
Substrate/Competitorn/a
Meas. Tech.Kinome-Wide Inhibitor Profiling
Kd 1.7±0.5 nM
Citation Kwarcinski, FEBrandvold, KRPhadke, SBeleh, OMJohnson, TKMeagher, JLSeeliger, MAStuckey, JASoellner, MB Conformation-Selective Analogues of Dasatinib Reveal Insight into Kinase Inhibitor Binding and Selectivity. ACS Chem Biol11:1296-304 (2016) 
 
Proto-oncogene tyrosine-protein kinase Src [251-533]
Name:Proto-oncogene tyrosine-protein kinase Src [251-533]
Type:Protein
Mol. Mass.:32360.42
Organism:Gallus gallus (Chicken)
Description:Wild-type chicken c-Src kinase domain (251-533aa)
Residue:283
BDBM185673
NameBDBM185673
Synonyms:DAS-CHO-II
TypeSmall organic molecule
Emp. Form.C28H31N7O3S
Mol. Mass.545.656
SMILESCc1nc(Nc2ncc(s2)C(=O)Nc2ccc(Oc3ccccc3)cc2C)cc(n1)N1CCN(CCO)CC1