Reaction Details
TargetTyrosine-protein kinase ABL1 [229-512]
LigandBDBM185673
Substrate/Competitorn/a
Meas. Tech.Kinome-Wide Inhibitor Profiling
Kd 0.32±0.02 nM
Citation Kwarcinski, FEBrandvold, KRPhadke, SBeleh, OMJohnson, TKMeagher, JLSeeliger, MAStuckey, JASoellner, MB Conformation-Selective Analogues of Dasatinib Reveal Insight into Kinase Inhibitor Binding and Selectivity. ACS Chem Biol11:1296-304 (2016) 
 
Tyrosine-protein kinase ABL1 [229-512]
Name:Tyrosine-protein kinase ABL1 [229-512]
Type:Protein
Mol. Mass.:32850.19
Organism:Homo sapiens (Human)
Description:Human c-Abl kinase domain (229-512aa)
Residue:284
BDBM185673
NameBDBM185673
Synonyms:DAS-CHO-II
TypeSmall organic molecule
Emp. Form.C28H31N7O3S
Mol. Mass.545.656
SMILESCc1nc(Nc2ncc(s2)C(=O)Nc2ccc(Oc3ccccc3)cc2C)cc(n1)N1CCN(CCO)CC1