Reaction Details
TargetTyrosine-protein kinase ABL1 [229-512]
LigandBDBM50322535
Substrate/Competitorn/a
Meas. Tech.Kinome-Wide Inhibitor Profiling
Kd 0.7±0.1 nM
Citation Kwarcinski, FEBrandvold, KRPhadke, SBeleh, OMJohnson, TKMeagher, JLSeeliger, MAStuckey, JASoellner, MB Conformation-Selective Analogues of Dasatinib Reveal Insight into Kinase Inhibitor Binding and Selectivity. ACS Chem Biol11:1296-304 (2016) 
 
Tyrosine-protein kinase ABL1 [229-512]
Name:Tyrosine-protein kinase ABL1 [229-512]
Type:Protein
Mol. Mass.:32850.19
Organism:Homo sapiens (Human)
Description:Human c-Abl kinase domain (229-512aa)
Residue:284
BDBM50322535
NameBDBM50322535
Synonyms:3-(imidazo[1,2-b]pyridazin-3-ylethynyl)-4-methyl-N-{4-[(4-methylpiperazin-1-yl)methyl]-3-(trifluoromethyl)phenyl}benzamide CHEMBL1171837 US10464902, Ponatinib | US9255107, AP24534
TypeSmall organic molecule
Emp. Form.C29H27F3N6O
Mol. Mass.532.5595
SMILESCN1CCN(Cc2ccc(NC(=O)c3ccc(C)c(c3)C#Cc3cnc4cccnn34)cc2C(F)(F)F)CC1